how to break admin password using command prompt

RECOMMENDED: If you have Windows errors then we strongly recommend that you download and run this (Windows) Repair Tool.

I'm new in c++. my friend just gave this code to me but it doesn't work and sends many syntax errors like : error C2146,error C2734, which I'm not familiar so I.

2014년 11월 24일. error C2734: 'a' : const object must be initialized if not extern. 해석해보면 extern이 아니라면 const는 반드시 초기화가 되어야 한다는 말입니다.

2011년 3월 20일. error C2734: 'a' : const object must be initialized if not extern. 해석해보면 extern이 아니라면 const는 반드시 초기화가 되어야 한다는 말입니다.

The identifier is declared const but not initialized or extern.

EC-111 Algorithms & Computing Lecture #7 Instructor: Jahan Zeb Department of Computer Engineering (DCE) College of E&ME NUST. – end main d:cpphtp4_examplesch04Fig04_07.cpp(6) : error C2734: ‘x’ : const object must be initialized. EC-111.

groveLocNode.cxx(12) : error C2653: ‘Node’ : is not a class or namespace name.groveLocNode.cxx(12) : error C2734: ‘IID’ : const object must be initialized if not extern.groveLocNode.cxx(12) : error C2239: unexpected token ‘tag::id’.

3 4 int main() 5 { 6 const int x; // Error: x must be initialized 7 8 x = 7; // Error: cannot. d:cpphtp4_examplesch04Fig04_07.cpp(6) : error C2734: 'x' : const object.

'identifier' : const object must be initialized if not extern. The identifier is declared const but not initialized or extern. The following sample generates C2734:

Compiler Error C2733 – msdn.microsoft.com – Compiler Errors C2700 Through C2799 Compiler Error C2733. Compiler Error C2733. Compiler Error C2733. Compiler Error C2734. Compiler Error C2735. Compiler Error.

I'm new to C++ and I'm studying out of a book (Game Programming – All In One, 2002).

The identifier is declared const but not. const int j; // C2734

Selection.querytable.delete Error 1004 It's a strange quirk of Excel, but it has problems changing selection within a worksheet if the focus is elsewhere. Excel VB Run Time Error 1004 – RESOLVED I have lengthy code that essentialy connects to Yahoo and downloads the balance sheet, income statement, and statement of cash flows for

Lazada guarantee that all purchased products are genuine, brand new and not defective. If the products received are not at the conditions described above, please notify us within 48 hours from the time you received the item. Lazada has the.

Mar 16, 2017. I had this error few time on my local hadoop 2.7.3+Spark2.1.0. endCustomer __c#2732, tx_group_count#2733L, quoteId__c#2734,

error C2734: ‘sentry’ : const object must be initialized if not extern D:Program FilesDevStudioVCINCLUDEbitset(204) : error C2059: syntax error : ‘identifier’ D:Program FilesDevStudioVCINCLUDEbitset(205) : error C2065: ‘_Ok’ :.

2012年7月2日. 关于error C2143: syntax error : missing ';' before 'tag::id' 的问题. BallTree.cpp( 11) : error C2734: 'index' : const object must be initialized if not.

Run Time Error 482 Printer Error Javascript Error Undefined Variable Notifier To disable "Display a Notification about Every Script Error", use the. setting that cookie, or the JavaScript sets the cookie to be undefined. Nurse Struck Off For Drug Error Former Yeovil Hospital nurse suspended for 12 months after series. – May 11, 2017. A nurse

This error occurs in the following situations: The argument is not a user defined type; _uuidof cannot extract the GUID from its argument. For example: struct __declspec(uuid("00000000-0000-0000-0000-000000000000")) A { }; void foo(void) {.

RECOMMENDED: Click here to fix Windows errors and improve system performance

Pages